{"text_format":"1","workbook":"xlsx","n_sheets":7,"sheets":["Cover page ","Dashboard","Inputs","Model","Graph Calcs","Legend","Names"],"not_rendered":{"charts":5,"images":0,"macros":1,"external_links":3,"defined_names":80,"comments":0,"pivot_tables":0},"unopened":[],"bounds":{"document_bytes":16777216,"sheet_cells":100000,"rows_first":2000,"rows_last":500,"rows_between":2000,"halvings":0,"cell_chars":16384,"cell_head_chars":4096},"cells_cut":0,"cells_raw":0,"read":"whole","date_system":"1900"}

{"sheet":"Cover page ","index":0,"n_rows":17,"n_cols":7,"rows_kept":17,"cut":false,"hidden":false,"merged":[[16,0,16,16383],[14,0,14,16383]]}
[]
[]
[]
[]
[]
[]
[]
[]
[]
[]
[]
[]
[null,null,null,null,null,null,{"$f":"Name_Model","v":"FGN 5M Solar Connections Facility - SHS"}]
[]
[{"$f":"Names!E9","v":"[Insert Company Name]"}]
[]
[{"$f":"Names!E10","v":"[Insert Project Name, Location]"}]

{"sheet":"Dashboard","index":1,"n_rows":33,"n_cols":35,"rows_kept":33,"cut":false,"hidden":false,"merged":[]}
[null,null,{"$f":"Name_Model","v":"FGN 5M Solar Connections Facility - SHS"}]
[]
[null,null,"Dashboard"]
[]
["●",null,"Model Information"]
[]
[null,null,"Company name",{"$f":"Names!E9","v":"[Insert Company Name]"},null,null,null,null,"Model checks"]
[null,null,"Model name",{"$f":"CONCATENATE(Names!E9,\" \",Name_Model)","v":"[Insert Company Name] FGN 5M Solar Connections Facility - SHS"},null,null,null,null,"Model balances",null,{"$f":"Model!P74","v":0}]
[null,null,"Location","LGA, State, Nigeria",null,null,null,null,"Cash balance always positive",null,{"$f":"Model!O103","v":0}]
[null,null,null,null,null,null,null,null,"Inputs correct",null,{"$f":"Inputs!E160","v":0}]
[null,null,null,null,null,null,null,null,"Operating Scenario",null,{"$f":"Inputs!E25","v":"Base"}]
[]
[null,null,null,null,null,null," "]
["●",null,"Key Outputs",null,null,null,null,null,null,null,null,null,null,"Graphs"]
[]
[]
[null,null,"Financial Statements"]
[null,null,"Income statement key outputs",null,null,null,{"$f":"Start_Year","v":2020},{"$f":"G18+1","v":2021},{"$f":"H18+1","v":2022},2023,2024,2025]
[null,null,"Revenue",{"$f":"Inputs!$E$9","v":"USD"},null,null,{"$f":"Model!I16","v":890000},{"$f":"Model!J16","v":1246000},{"$f":"Model!K16","v":1682100},{"$f":"Model!L16","v":2186730},{"$f":"Model!M16","v":2842749.0000000005},{"$f":"Model!N16","v":3411298.8000000003}]
[null,null,"Operating Expenses (inc VAT)",{"$f":"Inputs!$E$9","v":"USD"},null,null,{"$f":"Model!I25+Model!I27","v":-100216.25},{"$f":"Model!J25+Model!J27","v":-141044.25},{"$f":"Model!K25+Model!K27","v":-189518.54500000001},{"$f":"Model!L25+Model!L27","v":-257252.41385000001},{"$f":"Model!M25+Model!M27","v":-335537.19109300012},{"$f":"Model!N25+Model!N27","v":-414033.27405776014}]
[null,null,"EBITDA",{"$f":"Inputs!$E$9","v":"USD"},null,null,{"$f":"Model!I29","v":166608.75},{"$f":"Model!J29","v":232510.75},{"$f":"Model!K29","v":314780.70499999996},{"$f":"Model!L29","v":398336.6111499999},{"$f":"Model!M29","v":516728.54140700027},{"$f":"Model!N29","v":608685.60494224005}]
[null,null,"Net Income",{"$f":"Inputs!$E$9","v":"USD"},null,null,{"$f":"Model!I42","v":111389.95},{"$f":"Model!J42","v":156648.71},{"$f":"Model!K42","v":212705.08384444442},{"$f":"Model!L42","v":269771.77080285043},{"$f":"Model!M42","v":350770.4958555256},{"$f":"Model!N42","v":413361.79028961214}]
[null,null,"Profit margin","%",{"$f":"SUM(G22:K22)/SUM(G19:K19)","v":0.12447314802194141},null,{"$f":"G22/G19","v":0.12515724719101123},{"$f":"H22/H19","v":0.12572127608346709},0.12645210382524488,0.12336766349885465,0.12339130041221562,{"$f":"L22/L19","v":0.12117431351648589}]
[]
[null,null,"Balance sheet key outputs"]
[null,null,"Cash balance",{"$f":"Inputs!$E$9","v":"USD"},null,null,{"$f":"Model!I48","v":122605.08698630136},{"$f":"Model!J48","v":225678.74066971079},{"$f":"Model!K48","v":378597.91481988458},{"$f":"Model!L48","v":585142.11208683474},{"$f":"Model!M48","v":857071.3948285433},{"$f":"Model!N48","v":1210925.3700588655}]
[null,null,"Debt",{"$f":"Inputs!$E$9","v":"USD"},null,null,{"$f":"Model!I64","v":84146.575342465745},{"$f":"Model!J64","v":85305.205479452052},{"$f":"Model!K64","v":89537.027397260274},{"$f":"Model!L64","v":96398.135616438361},{"$f":"Model!M64","v":109067.57630136987},{"$f":"Model!N64","v":130881.09156164384}]
[null,null,"Equity",{"$f":"Inputs!$E$9","v":"USD"},null,null,{"$f":"Model!I70","v":166514.95000000001},{"$f":"Model!J70","v":323163.65999999997},{"$f":"Model!K70","v":535868.7438444444},{"$f":"Model!L70","v":805640.51464729477},{"$f":"Model!M70","v":1156411.0105028204},{"$f":"Model!N70","v":1569772.8007924324}]
[null,null,"Debt:equity ratio","multiple",null,null,{"$f":"G27/G28","v":0.50533946256756967},{"$f":"H27/H28","v":0.26396905357320205},{"$f":"I27/I28","v":0.16708760946738793},{"$f":"J27/J28","v":0.11965403162307567},{"$f":"K27/K28","v":9.4315580974921778E-2},{"$f":"L27/L28","v":8.3375818141054645E-2}]
[]
[]
[null,null,null,null,null,null,null,null,null,null,null,null,null,null,null,null,null,null,null,null,null,null,null,null,null,null,null,null,null,null,null,"DO NOT DELETE"]
[null,null,null,null,null,null,null,null,null,null,null,null,null,null,null,null,null,null,null,null,null,null,null,null,null,null,null,null,null,null,null,{"$f":"Model!F195","v":0},"Upside","Downside","Base"]

{"sheet":"Inputs","index":2,"n_rows":228,"n_cols":31,"rows_kept":228,"cut":false,"hidden":false,"merged":[[96,6,96,8]]}
[null,"Input Sheet",{"$f":"Name_Model","v":"FGN 5M Solar Connections Facility - SHS"}]
[]
[null,null,"Inputs"]
[]
["●",null,"Timing"]
[null,null,"Start"]
[null,null,"Model Start Date","Date","2020-01-01"]
[null,null,"Model Start Year","Date",{"$f":"YEAR(E7)","v":2020}]
[null,null,"Model Currency","USD/NGN","USD",null,null,null,null,null,null,null,null,null,null,"USD"]
[null,null,null,null,null,null,null,null,null,null,null,null,null,null,null,"NGN"]
[]
[]
[]
[]
[]
[]
[]
[]
[]
[]
[]
[]
["●",null,"Operating Scenario"]
[]
[null,null,"Operating Scenario","Name","Base"]
[]
["●",null,"COGS assumptions"]
[]
[null,null,"Product 1",null,null,null,"NGN Inputs"]
[null,null,"System name","Name"]
[null,null,"System cost",{"$f":"$E$9","v":"USD"},{"$f":"IF($E$9=\"NGN\",G31,(G31/$E$202))","v":175},null,70000]
[null,null,"Shipping cost",{"$f":"$E$9","v":"USD"},{"$f":"IF($E$9=\"NGN\",G32,(G32/$E$202))","v":8.75},null,3500]
[null,null,"Installation cost","% module cost",0.05]
[null,null,"Total COGS",{"$f":"$E$9","v":"USD"},{"$f":"SUM(E31:E32)*E33+(E31+E32)","v":192.9375}]
[]
[null,null,"Product 2"]
[null,null,"System name","Name"]
[null,null,"System cost",{"$f":"$E$9","v":"USD"},{"$f":"IF($E$9=\"NGN\",G38,(G38/$E$202))","v":450},null,180000]
[null,null,"Shipping cost",{"$f":"$E$9","v":"USD"},{"$f":"IF($E$9=\"NGN\",G39,(G39/$E$202))","v":16.25},null,6500]
[null,null,"Installation cost","% module cost",0.05]
{"$rows_left_out":189}
{"sheet":"Model","index":3,"n_rows":196,"n_cols":16,"rows_kept":196,"cut":false,"hidden":false,"merged":[]}
[null,null,{"$f":"Name_Model","v":"FGN 5M Solar Connections Facility - SHS"}]
[]
[null,null,"Model"]
[]
[null,null,null,null,null,null,null,null,{"$f":"CONCATENATE(\"Annual  summary\",\" \",Inputs!$E$9)","v":"Annual  summary USD"}]
[null,null,"Year",null,null,null,null,null,{"$f":"Start_Year","v":2020},{"$f":"I6+1","v":2021},{"$f":"J6+1","v":2022},2023,2024,2025]
[null,null,"Period start",null,null,null,null,null,{"$f":"Inputs!E7","v":"2020-01-01"},{"$f":"EOMONTH(I7,11)+1","v":"2021-01-01"},{"$f":"EOMONTH(J7,11)+1","v":"2022-01-01"},"2023-01-01","2024-01-01","2025-01-01"]
[null,null,"Period end",null,null,null,null,"2020-01-01",{"$f":"EOMONTH(I7,11)","v":"2020-12-31"},{"$f":"EOMONTH(J7,11)","v":"2021-12-31"},"2022-12-31","2023-12-31","2024-12-31",{"$f":"EOMONTH(N7,11)","v":"2025-12-31"}]
[null,null,"Period"]
[null,null,"Inflation index",null,null,null,null,null,{"$f":"Inputs!I198","v":1},{"$f":"Inputs!J198","v":1.1000000000000001},{"$f":"Inputs!K198","v":1.2100000000000002},{"$f":"Inputs!L198","v":1.3310000000000004},{"$f":"Inputs!M198","v":1.4641000000000006},{"$f":"Inputs!N198","v":1.6105100000000008}]
[null,null,"USD:Naira FX rate (EOP)",null,null,null,null,{"$f":"Inputs!E202","v":400},{"$f":"Inputs!I201","v":400},{"$f":"Inputs!J201","v":432},{"$f":"Inputs!K201","v":466.56000000000006},{"$f":"Inputs!L201","v":503.8848000000001},{"$f":"Inputs!M201","v":544.19558400000017},{"$f":"Inputs!N201","v":587.73123072000021}]
[]
["●",null,"Income Statement"]
[]
[null,null,"Gross income"]
[null,null,"Sales revenue",{"$f":"Inputs!$E$9","v":"USD"},null,null,null,null,{"$f":"I120+I130","v":890000},{"$f":"J120+J130","v":1246000},1682100,2186730,2842749.0000000005,3411298.8000000003]
[null,null,"COGS ",{"$f":"Inputs!$E$9","v":"USD"},null,null,null,null,{"$f":"-(Inputs!$E$34*Inputs!I49)+-(Inputs!$E$41*Inputs!I64)","v":-623175},{"$f":"-(Inputs!$E$34*Inputs!J49)+-(Inputs!$E$41*Inputs!J64)","v":-872445},{"$f":"-(Inputs!$E$34*Inputs!K49)+-(Inputs!$E$41*Inputs!K64)","v":-1177800.75},{"$f":"-(Inputs!$E$34*Inputs!L49)+-(Inputs!$E$41*Inputs!L64)","v":-1531140.9750000001},{"$f":"-(Inputs!$E$34*Inputs!M49)+-(Inputs!$E$41*Inputs!M64)","v":-1990483.2675000001},{"$f":"-(Inputs!$E$34*Inputs!N49)+-(Inputs!$E$41*Inputs!N64)","v":-2388579.9210000001}]
[null,null,"Total gross income",{"$f":"Inputs!$E$9","v":"USD"},null,null,null,null,{"$f":"I16+I17","v":266825},{"$f":"J16+J17","v":373555},504299.25,655589.02499999991,852265.73250000039,1022718.8790000002]
[]
[null,null,"Operating costs"]
[null,null,"Corporate salaries and benefits",{"$f":"Inputs!$E$9","v":"USD"},null,null,null,null,{"$f":"-Inputs!I87 *I10","v":-6303.75},{"$f":"-Inputs!J87 *J10","v":-9471},{"$f":"-Inputs!K87 *K10","v":-10418.100000000002},{"$f":"-Inputs!L87 *L10","v":-21078.048750000005},{"$f":"-Inputs!M87 *M10","v":-23185.853625000011},{"$f":"-Inputs!N87 *N10","v":-30209.141325000015}]
[null,null,"Corporate office expenses",{"$f":"Inputs!$E$9","v":"USD"},null,null,null,null,{"$f":"-Inputs!$E$95*I10","v":-3742.5},{"$f":"-Inputs!$E$95*J10","v":-4116.75},{"$f":"-Inputs!$E$95*K10","v":-4528.4250000000011},{"$f":"-Inputs!$E$95*L10","v":-4981.2675000000017},{"$f":"-Inputs!$E$95*M10","v":-5479.3942500000021},{"$f":"-Inputs!$E$95*N10","v":-6027.3336750000026}]
[null,null,"Corporate administrative expenses",{"$f":"Inputs!$E$9","v":"USD"},null,null,null,null,{"$f":"-Inputs!$E$102*I10","v":-1645},{"$f":"-Inputs!$E$102*J10","v":-1809.5000000000002},{"$f":"-Inputs!$E$102*K10","v":-1990.4500000000003},{"$f":"-Inputs!$E$102*L10","v":-2189.4950000000008},{"$f":"-Inputs!$E$102*M10","v":-2408.444500000001},{"$f":"-Inputs!$E$102*N10","v":-2649.2889500000015}]
[null,null,"Direct sales and service cost",{"$f":"Inputs!$E$9","v":"USD"},null,null,null,null,{"$f":"-Inputs!I120*I10","v":-21775},{"$f":"-Inputs!J120*J10","v":-32197.000000000004},{"$f":"-Inputs!K120*K10","v":-46424.070000000007},{"$f":"-Inputs!L120*L10","v":-64998.85260000002},{"$f":"-Inputs!M120*M10","v":-91257.323718000058},{"$f":"-Inputs!N120*N10","v":-119300.10010776007}]
[null,null,"Total operating costs",{"$f":"Inputs!$E$9","v":"USD"},null,null,null,null,{"$f":"SUM(I21:I24)","v":-33466.25},-47594.25,-63361.045000000013,-93247.663850000026,-122331.01609300007,-158185.8640577601]
[]
[null,null,"VAT on sales",{"$f":"Inputs!$E$9","v":"USD"},null,{"$f":"Inputs!E142","v":7.4999999999999997E-2},null,null,{"$f":"-$F$27*I16","v":-66750},-93450,-126157.5,-164004.75,-213206.17500000002,-255847.41]
[]
[null,null,"EBITDA",{"$f":"Inputs!$E$9","v":"USD"},null,null,null,null,{"$f":"I18+I25+I27","v":166608.75},232510.75,314780.70499999996,398336.6111499999,516728.54140700027,608685.60494224005]
[]
[null,null,"Depreciation",{"$f":"Inputs!$E$9","v":"USD"},null,null,null,null,{"$f":"-(I141)","v":-300},{"$f":"-(J141)","v":-270},-729.1111111111112,-988.41879286694098,-889.57691358024681,-800.61922222222211]
[]
[null,null,"EBIT",{"$f":"Inputs!$E$9","v":"USD"},null,null,null,null,{"$f":"I29+I31","v":166308.75},{"$f":"J29+J31","v":232240.75},314051.59388888883,397348.19235713297,515838.96449342003,607884.98572001781]
[]
[null,null,"Interest expense",{"$f":"Inputs!$E$9","v":"USD"},null,null,null,null,{"$f":"-(IF(Inputs!$E$9=\"NGN\",(I174+I190),I183))","v":-2500},{"$f":"-(IF(Inputs!$E$9=\"NGN\",(J174+J190),J183))","v":-1875},{"$f":"-(IF(Inputs!$E$9=\"NGN\",(K174+K190),K183))","v":-1250},{"$f":"-(IF(Inputs!$E$9=\"NGN\",(L174+L190),L183))","v":-625},{"$f":"-(IF(Inputs!$E$9=\"NGN\",(M174+M190),M183))","v":0},{"$f":"-(IF(Inputs!$E$9=\"NGN\",(N174+N190),N183))","v":0}]
[null,null,"FX (gains)/losses",{"$f":"Inputs!$E$9","v":"USD"},null,null,null,null,{"$f":"(IF(Inputs!$E$9=\"NGN\",I189,0))","v":0},{"$f":"(IF(Inputs!$E$9=\"NGN\",J189,0))","v":0},{"$f":"(IF(Inputs!$E$9=\"NGN\",K189,0))","v":0},{"$f":"(IF(Inputs!$E$9=\"NGN\",L189,0))","v":0},{"$f":"(IF(Inputs!$E$9=\"NGN\",M189,0))","v":0},{"$f":"(IF(Inputs!$E$9=\"NGN\",N189,0))","v":0}]
[]
[null,null,"EBT",{"$f":"Inputs!$E$9","v":"USD"},null,null,null,null,{"$f":"I33+SUM(I35:I36)","v":163808.75},{"$f":"J33+SUM(J35:J36)","v":230365.75},312801.59388888883,396723.19235713297,515838.96449342003,607884.98572001781]
[null,null,null,null,null,null,null," "]
[null,null,"Income tax payable",{"$f":"Inputs!$E$9","v":"USD"},null,{"$f":"Inputs!E143","v":0.32},null,null,{"$f":"-$F40*MAX(I38,0)","v":-52418.8},{"$f":"-$F40*MAX(J38,0)","v":-73717.040000000008},-100096.51004444443,-126951.42155428256,-165068.4686378944,-194523.1954304057]
{"$rows_left_out":157}
{"sheet":"Graph Calcs","index":4,"n_rows":36,"n_cols":16,"rows_kept":36,"cut":false,"hidden":false,"merged":[]}
["Graph Calculations"]
[{"$f":"Name_Model","v":"FGN 5M Solar Connections Facility - SHS"}]
[]
[null,null,null,null,null,null,null,null,{"$f":"CONCATENATE(\"Annual  summary\",\" \",Inputs!$E$9)","v":"Annual  summary USD"},null,null,null,null,null,null,{"$f":"P6","v":0}]
[null,null,"Year",null,null,null,null,null,{"$f":"Start_Year","v":2020},{"$f":"I5+1","v":2021},{"$f":"J5+1","v":2022},2023,2024,2025]
[]
["x",null,"Graphs"]
[]
[null,null,"Income Statement"]
[null,null,"Revenue",{"$f":"Inputs!$E$9","v":"USD"},null,null,null,null,{"$f":"Model!I$16","v":890000},{"$f":"Model!J$16","v":1246000},{"$f":"Model!K$16","v":1682100},{"$f":"Model!L$16","v":2186730},{"$f":"Model!M$16","v":2842749.0000000005},{"$f":"Model!N$16","v":3411298.8000000003}]
[null,null,"Net income",{"$f":"Inputs!$E$9","v":"USD"},null,null,null,null,{"$f":"Model!I$42","v":111389.95},{"$f":"Model!J$42","v":156648.71},{"$f":"Model!K$42","v":212705.08384444442},{"$f":"Model!L$42","v":269771.77080285043},{"$f":"Model!M$42","v":350770.4958555256},{"$f":"Model!N$42","v":413361.79028961214}]
[null,null,"Tax",{"$f":"Inputs!$E$9","v":"USD"},null,null,null,null,{"$f":"-Model!I40","v":52418.8},{"$f":"-Model!J40","v":73717.040000000008},{"$f":"-Model!K40","v":100096.51004444443},{"$f":"-Model!L40","v":126951.42155428256},{"$f":"-Model!M40","v":165068.4686378944},{"$f":"-Model!N40","v":194523.1954304057}]
[null,null,"Interest & FX depreciation",{"$f":"Inputs!$E$9","v":"USD"},null,null,null,null,{"$f":"-(Model!I35+Model!I36)","v":2500},{"$f":"-(Model!J35+Model!J36)","v":1875},{"$f":"-(Model!K35+Model!K36)","v":1250},{"$f":"-(Model!L35+Model!L36)","v":625},{"$f":"-(Model!M35+Model!M36)","v":0},{"$f":"-(Model!N35+Model!N36)","v":0}]
[null,null,"Depreciation",{"$f":"Inputs!$E$9","v":"USD"},null,null,null,null,{"$f":"-Model!I31","v":300},{"$f":"-Model!J31","v":270},{"$f":"-Model!K31","v":729.1111111111112},{"$f":"-Model!L31","v":988.41879286694098},{"$f":"-Model!M31","v":889.57691358024681},{"$f":"-Model!N31","v":800.61922222222211}]
[null,null,"OPEX & VAT",{"$f":"Inputs!$E$9","v":"USD"},null,null,null,null,{"$f":"-(Model!I25+Model!I27)","v":100216.25},{"$f":"-(Model!J25+Model!J27)","v":141044.25},{"$f":"-(Model!K25+Model!K27)","v":189518.54500000001},{"$f":"-(Model!L25+Model!L27)","v":257252.41385000001},{"$f":"-(Model!M25+Model!M27)","v":335537.19109300012},{"$f":"-(Model!N25+Model!N27)","v":414033.27405776014}]
[null,null,"COGS",{"$f":"Inputs!$E$9","v":"USD"},null,null,null,null,{"$f":"-Model!I17","v":623175},{"$f":"-Model!J17","v":872445},{"$f":"-Model!K17","v":1177800.75},{"$f":"-Model!L17","v":1531140.9750000001},{"$f":"-Model!M17","v":1990483.2675000001},{"$f":"-Model!N17","v":2388579.9210000001}]
[null,null,"Net margin","%",null,null,null,null,{"$f":"'Graph Calcs'!I11/'Graph Calcs'!I10","v":0.12515724719101123},{"$f":"'Graph Calcs'!J11/'Graph Calcs'!J10","v":0.12572127608346709},{"$f":"'Graph Calcs'!K11/'Graph Calcs'!K10","v":0.12645210382524488},{"$f":"'Graph Calcs'!L11/'Graph Calcs'!L10","v":0.12336766349885465},{"$f":"'Graph Calcs'!M11/'Graph Calcs'!M10","v":0.12339130041221562},{"$f":"'Graph Calcs'!N11/'Graph Calcs'!N10","v":0.12117431351648589}]
[]
[null,null,"Cashflow Statement"]
[null,null,"Operating activities",{"$f":"Inputs!$E$9","v":"USD"},null,null,null,null,{"$f":"Model!I84","v":20480.086986301365},{"$f":"Model!J84","v":120434.76479452052},{"$f":"Model!K84","v":168741.36207884323},{"$f":"Model!L84","v":219044.19726695018},{"$f":"Model!M84","v":284429.28274170862},{"$f":"Model!N84","v":355895.72482142347}]
[null,null,"CAPEX",{"$f":"Inputs!$E$9","v":"USD"},null,null,null,null,{"$f":"Model!I87","v":0},{"$f":"Model!J87","v":-4861.1111111111113},{"$f":"Model!K87","v":-3322.1879286694098},{"$f":"Model!L87","v":0},{"$f":"Model!M87","v":0},{"$f":"Model!N87","v":-2041.7495911012588}]
[null,null,"Debt repayment ",{"$f":"Inputs!$E$9","v":"USD"},null,null,null,null,{"$f":"Model!I193+Model!I94","v":0},{"$f":"Model!J193+Model!J94","v":-12500},{"$f":"Model!K193+Model!K94","v":-12500},{"$f":"Model!L193+Model!L94","v":-12500},{"$f":"Model!M193+Model!M94","v":-12500},{"$f":"Model!N193+Model!N94","v":0}]
[null,null,"Debt issuance",{"$f":"Inputs!$E$9","v":"USD"},null,null,null,null,{"$f":"Model!I195+Model!I96","v":70480.086986301365},{"$f":"Model!J195+Model!J96","v":103073.65368340941},{"$f":"Model!K195+Model!K96","v":152919.17415017381},{"$f":"Model!L195+Model!L96","v":206544.19726695018},{"$f":"Model!M195+Model!M96","v":271929.28274170862},{"$f":"Model!N195+Model!N96","v":353853.97523032222}]
[null,null,"Equity or grants",{"$f":"Inputs!$E$9","v":"USD"},null,null,null,null,{"$f":"Model!I67+Model!I68","v":54025},{"$f":"Model!J67+Model!J68","v":54025},{"$f":"Model!K67+Model!K68","v":54025},{"$f":"Model!L67+Model!L68","v":54025},{"$f":"Model!M67+Model!M68","v":54025},{"$f":"Model!N67+Model!N68","v":54025}]
[null,null,"End cash",{"$f":"Inputs!$E$9","v":"USD"},null,null,null,null,{"$f":"Model!I103","v":122605.08698630136},{"$f":"Model!J103","v":225678.74066971079},{"$f":"Model!K103","v":378597.91481988458},{"$f":"Model!L103","v":585142.11208683474},{"$f":"Model!M103","v":857071.3948285433},{"$f":"Model!N103","v":1210925.3700588655}]
[]
[null,null,"Sales & Working Capital need"]
[null,null,"Sales",{"$f":"Inputs!$E$9","v":"USD"},null,null,null,null,{"$f":"Model!I16","v":890000},{"$f":"Model!J16","v":1246000},{"$f":"Model!K16","v":1682100},{"$f":"Model!L16","v":2186730},{"$f":"Model!M16","v":2842749.0000000005},{"$f":"Model!N16","v":3411298.8000000003}]
[null,null,"Working capital",{"$f":"Inputs!$E$9","v":"USD"},null,null,null,null,{"$f":"Model!I158","v":91209.863013698632},{"$f":"Model!J158","v":127693.8082191781},{"$f":"Model!K158","v":172386.6410958904},{"$f":"Model!L158","v":224102.63342465757},{"$f":"Model!M158","v":291333.42345205479},{"$f":"Model!N158","v":349600.1081424657}]
[]
[null,null,"OPEX Breakdown"]
[null,null,"Total OPEX",{"$f":"Inputs!$E$9","v":"USD"},null,null,null,null,{"$f":"-Model!I25","v":33466.25},{"$f":"-Model!J25","v":47594.25},{"$f":"-Model!K25","v":63361.045000000013},{"$f":"-Model!L25","v":93247.663850000026},{"$f":"-Model!M25","v":122331.01609300007},{"$f":"-Model!N25","v":158185.8640577601}]
[]
[null,null,"Equity payback graph"]
[null,null,"Equity invested",{"$f":"Inputs!$E$9","v":"USD"},null,null,null,null,{"$f":"Model!I67","v":4025},{"$f":"Model!J67","v":4025},{"$f":"Model!K67","v":4025},{"$f":"Model!L67","v":4025},{"$f":"Model!M67","v":4025},{"$f":"Model!N67","v":4025}]
[null,null,"Distributions to equity",{"$f":"Inputs!$E$9","v":"USD"},null,null,null,null,{"$f":"Model!I106","v":20480.086986301365},{"$f":"Model!J106","v":103073.65368340941},{"$f":"Model!K106","v":152919.17415017381},{"$f":"Model!L106","v":206544.19726695018},{"$f":"Model!M106","v":271929.28274170862},{"$f":"Model!N106","v":353853.97523032222}]

{"sheet":"Legend","index":5,"n_rows":36,"n_cols":7,"rows_kept":36,"cut":false,"hidden":false,"merged":[]}
[]
[null,null,"Style legend"]
[]
[]
[]
[null,null,"Style",null,"Design",null,"Comment"]
[]
[null,null,"Header1",null,"Header1"]
[]
[null,null,"Header2",null,"Header2"]
[]
[null,null,"Header3",null,"Header3"]
[]
[null,null,"Assumption",null,100,null,"A user driven input"]
[]
[null,null,"Technical_Input",null,100,null,"A model input that should not be changed to protect the integrity of the model"]
[]
[null,null,"Empty_Cell",null,null,null,"A cell that is left intentionally blank to avoid the risk of error"]
[]
[null,null,"InSheet",null,100,null,"A link within the worksheet or an interim calculation step"]
[]
[null,null,"OffSheet ",null,100,null,"A link to another worksheet to minimise the number of inter-worksheet references"]
[]
[null,null,"Line_SubTotal",null,100,null,"The sum of elements in the table immediately above"]
[]
[null,null,"Line_Total",null,100,null,"The sum of elements above, including sub-totals "]
[]
[null,null,"Unit / Info",null,"NGN",null,"Explanatory text showing helpful information and the units/dimensions of the calculations"]
[]
[null,null,"Line_Summary",null,100,null,"The SUM() of everything to the right"]
[]
[null,null,"Table_Header",null,"Qtr",null,"Header of a table or of an off-sheet reference "]
[]
[null,null,"Flag",null,1,null,"Binary flag - set up as a 'Style' and updated with conditional formatting"]
[]
[null,null,"Line_ClosingBal",null,100,null,"The closing balance of a control account"]

{"sheet":"Names","index":6,"n_rows":25,"n_cols":5,"rows_kept":25,"cut":false,"hidden":false,"merged":[]}
[]
[null,null,"Names and Lists"]
[]
[]
[null,null,"Name",null,"Value"]
[]
[null,null,"Entity Names"]
[null,null,"Model Name",null,"FGN 5M Solar Connections Facility - SHS"]
[null,null,"Company Name",null,"[Insert Company Name]"]
[null,null,"Project Name",null,"[Insert Project Name, Location]"]
[]
[null,null,"Lists"]
[null,null,"Price increase dropdown",null,"Inflation"]
[null,null,null,null,"Inflation+ x%"]
[]
[null,null,"Year",null,{"$f":"Start_Year","v":2020}]
[null,null,null,null,{"$f":"E16+1","v":2021}]
[null,null,null,null,{"$f":"E17+1","v":2022}]
[null,null,null,null,2023]
[null,null,null,null,2024]
[null,null,null,null,2025]
[]
[null,null,"Scenario",null,"Upside"]
[null,null,null,null,"Base"]
[null,null,null,null,"Downside"]