{"text_format":"1","workbook":"xlsx","n_sheets":7,"sheets":["Cover page ","Names","Legend","Dashboard","Inputs","Model","Graph Calcs"],"not_rendered":{"charts":5,"images":0,"macros":1,"external_links":3,"defined_names":80,"comments":0,"pivot_tables":0},"unopened":[],"bounds":{"document_bytes":16777216,"sheet_cells":100000,"rows_first":2000,"rows_last":500,"rows_between":2000,"halvings":0,"cell_chars":16384,"cell_head_chars":4096},"cells_cut":0,"cells_raw":0,"read":"whole","date_system":"1900"}

{"sheet":"Cover page ","index":0,"n_rows":17,"n_cols":7,"rows_kept":17,"cut":false,"hidden":false,"merged":[[16,0,16,16383],[14,0,14,16383]]}
[]
[]
[]
[]
[]
[]
[]
[]
[]
[]
[]
[]
[null,null,null,null,null,null,{"$f":"Name_Model","v":"FGN 5M Solar Connections Facility - SHS"}]
[]
[{"$f":"Names!E9","v":"[Insert Company Name]"}]
[]
[{"$f":"Names!E10","v":"[Insert Project Name, Location]"}]

{"sheet":"Names","index":1,"n_rows":25,"n_cols":5,"rows_kept":25,"cut":false,"hidden":false,"merged":[]}
[]
[null,null,"Names and Lists"]
[]
[]
[null,null,"Name",null,"Value"]
[]
[null,null,"Entity Names"]
[null,null,"Model Name",null,"FGN 5M Solar Connections Facility - SHS"]
[null,null,"Company Name",null,"[Insert Company Name]"]
[null,null,"Project Name",null,"[Insert Project Name, Location]"]
[]
[null,null,"Lists"]
[null,null,"Price increase dropdown",null,"Inflation"]
[null,null,null,null,"Inflation+ x%"]
[]
[null,null,"Year",null,{"$f":"Start_Year","v":2020}]
[null,null,null,null,{"$f":"E16+1","v":2021}]
[null,null,null,null,{"$f":"E17+1","v":2022}]
[null,null,null,null,2023]
[null,null,null,null,2024]
[null,null,null,null,2025]
[]
[null,null,"Scenario",null,"Upside"]
[null,null,null,null,"Base"]
[null,null,null,null,"Downside"]

{"sheet":"Legend","index":2,"n_rows":36,"n_cols":7,"rows_kept":36,"cut":false,"hidden":false,"merged":[]}
[]
[null,null,"Style legend"]
[]
[]
[]
[null,null,"Style",null,"Design",null,"Comment"]
[]
[null,null,"Header1",null,"Header1"]
[]
[null,null,"Header2",null,"Header2"]
[]
[null,null,"Header3",null,"Header3"]
[]
[null,null,"Assumption",null,100,null,"A user driven input"]
[]
[null,null,"Technical_Input",null,100,null,"A model input that should not be changed to protect the integrity of the model"]
[]
[null,null,"Empty_Cell",null,null,null,"A cell that is left intentionally blank to avoid the risk of error"]
[]
[null,null,"InSheet",null,100,null,"A link within the worksheet or an interim calculation step"]
[]
[null,null,"OffSheet ",null,100,null,"A link to another worksheet to minimise the number of inter-worksheet references"]
[]
[null,null,"Line_SubTotal",null,100,null,"The sum of elements in the table immediately above"]
[]
[null,null,"Line_Total",null,100,null,"The sum of elements above, including sub-totals "]
[]
[null,null,"Unit / Info",null,"NGN",null,"Explanatory text showing helpful information and the units/dimensions of the calculations"]
[]
[null,null,"Line_Summary",null,100,null,"The SUM() of everything to the right"]
[]
[null,null,"Table_Header",null,"Qtr",null,"Header of a table or of an off-sheet reference "]
[]
[null,null,"Flag",null,1,null,"Binary flag - set up as a 'Style' and updated with conditional formatting"]
[]
[null,null,"Line_ClosingBal",null,100,null,"The closing balance of a control account"]

{"sheet":"Dashboard","index":3,"n_rows":33,"n_cols":35,"rows_kept":33,"cut":false,"hidden":false,"merged":[]}
[null,null,{"$f":"Name_Model","v":"FGN 5M Solar Connections Facility - SHS"}]
[]
[null,null,"Dashboard"]
[]
["●",null,"Model Information"]
[]
[null,null,"Company name",{"$f":"Names!E9","v":"[Insert Company Name]"},null,null,null,null,"Model checks"]
[null,null,"Model name",{"$f":"CONCATENATE(Names!E9,\" \",Name_Model)","v":"[Insert Company Name] FGN 5M Solar Connections Facility - SHS"},null,null,null,null,"Model balances",null,{"$f":"Model!P74","v":0}]
[null,null,"Location","LGA, State, Nigeria",null,null,null,null,"Cash balance always positive",null,{"$f":"Model!O103","v":0}]
[null,null,null,null,null,null,null,null,"Inputs correct",null,{"$f":"Inputs!E246","v":0}]
[null,null,null,null,null,null,null,null,"Operating Scenario",null,{"$f":"Inputs!E25","v":"Base"}]
[]
[null,null,null,null,null,null," "]
["●",null,"Key Outputs",null,null,null,null,null,null,null,null,null,null,"Graphs"]
[]
[]
[null,null,"Financial Statements"]
[null,null,"Income statement key outputs",null,null,null,{"$f":"Start_Year","v":2020},{"$f":"G18+1","v":2021},{"$f":"H18+1","v":2022},2023,2024,2025]
[null,null,"Revenue",{"$f":"Inputs!$E$9","v":"USD"},null,null,{"$f":"Model!I16","v":2670000},{"$f":"Model!J16","v":3738000},{"$f":"Model!K16","v":5046300},{"$f":"Model!L16","v":6560190},{"$f":"Model!M16","v":8528247.0000000019},{"$f":"Model!N16","v":10233896.400000002}]
[null,null,"Operating Expenses (inc VAT)",{"$f":"Inputs!$E$9","v":"USD"},null,null,{"$f":"Model!I25+Model!I27","v":-269316.25},{"$f":"Model!J25+Model!J27","v":-382768.25},{"$f":"Model!K25+Model!K27","v":-523247.18500000006},{"$f":"Model!L25+Model!L27","v":-701683.41905000003},{"$f":"Model!M25+Model!M27","v":-928432.29352900037},{"$f":"Model!N25+Model!N27","v":-1145485.3272732804}]
[null,null,"EBITDA",{"$f":"Inputs!$E$9","v":"USD"},null,null,{"$f":"Model!I29","v":531158.75},{"$f":"Model!J29","v":737896.75},{"$f":"Model!K29","v":989650.56499999994},{"$f":"Model!L29","v":1265083.65595},{"$f":"Model!M29","v":1628364.9039710013},{"$f":"Model!N29","v":1922671.3097267216}]
[null,null,"Net Income",{"$f":"Inputs!$E$9","v":"USD"},null,null,{"$f":"Model!I42","v":359283.94999999995},{"$f":"Model!J42","v":500311.19},{"$f":"Model!K42","v":671616.58864444448},{"$f":"Model!L42","v":859159.76126685063},{"$f":"Model!M42","v":1106683.2223990462},{"$f":"Model!N42","v":1306872.0695430597}]
[null,null,"Profit margin","%",{"$f":"SUM(G22:K22)/SUM(G19:K19)","v":0.13175185032012113},null,{"$f":"G22/G19","v":0.13456327715355804},{"$f":"H22/H19","v":0.13384462011771001},0.13309089603163596,0.13096568258950589,0.1297667882272929,{"$f":"L22/L19","v":0.12770034192871635}]
[]
[null,null,"Balance sheet key outputs"]
[null,null,"Cash balance",{"$f":"Inputs!$E$9","v":"USD"},null,null,{"$f":"Model!I48","v":188079.36095890409},{"$f":"Model!J48","v":561847.60423135466},{"$f":"Model!K48","v":1084292.6174281039},{"$f":"Model!L48","v":1776792.8205015203},{"$f":"Model!M48","v":2670173.2497319551},{"$f":"Model!N48","v":3801004.1348349024}]
[null,null,"Debt",{"$f":"Inputs!$E$9","v":"USD"},null,null,{"$f":"Model!I64","v":152439.72602739726},{"$f":"Model!J64","v":180915.61643835617},{"$f":"Model!K64","v":218611.08219178082},{"$f":"Model!L64","v":264194.40684931504},{"$f":"Model!M64","v":327202.72890410962},{"$f":"Model!N64","v":392643.2746849315}]
[null,null,"Equity",{"$f":"Inputs!$E$9","v":"USD"},null,null,{"$f":"Model!I70","v":414408.94999999995},{"$f":"Model!J70","v":914720.1399999999},{"$f":"Model!K70","v":1586336.7286444444},{"$f":"Model!L70","v":2445496.489911295},{"$f":"Model!M70","v":3552179.7123103412},{"$f":"Model!N70","v":4859051.7818534011}]
[null,null,"Debt:equity ratio","multiple",null,null,{"$f":"G27/G28","v":0.36784853712111498},{"$f":"H27/H28","v":0.19778247851671463},{"$f":"I27/I28","v":0.1378087503392727},{"$f":"J27/J28","v":0.10803303457568983},{"$f":"K27/K28","v":9.2113224950349334E-2},{"$f":"L27/L28","v":8.0806563155242719E-2}]
[]
[]
[null,null,null,null,null,null,null,null,null,null,null,null,null,null,null,null,null,null,null,null,null,null,null,null,null,null,null,null,null,null,null,"DO NOT DELETE"]
[null,null,null,null,null,null,null,null,null,null,null,null,null,null,null,null,null,null,null,null,null,null,null,null,null,null,null,null,null,null,null,{"$f":"Model!F234","v":0},"Upside","Downside","Base"]

{"sheet":"Inputs","index":4,"n_rows":335,"n_cols":31,"rows_kept":335,"cut":false,"hidden":false,"merged":[[182,6,182,8]]}
[null,"Input Sheet",{"$f":"Name_Model","v":"FGN 5M Solar Connections Facility - SHS"}]
[]
[null,null,"Inputs"]
[]
["●",null,"Timing"]
[null,null,"Start"]
[null,null,"Model Start Date","Date","2020-01-01"]
[null,null,"Model Start Year","Date",{"$f":"YEAR(E7)","v":2020}]
[null,null,"Model Currency","USD/NGN","USD",null,null,null,null,null,null,null,null,null,null,"USD"]
[null,null,null,null,null,null,null,null,null,null,null,null,null,null,null,"NGN"]
[]
[]
[]
[]
[]
[]
[]
[]
[]
[]
[]
[]
["●",null,"Operating Scenario"]
[]
[null,null,"Operating Scenario","Name","Base"]
[]
["●",null,"COGS assumptions"]
[]
[null,null,"Product 1",null,null,null,"NGN Inputs"]
[null,null,"System name","Name"]
[null,null,"System cost",{"$f":"$E$9","v":"USD"},{"$f":"IF($E$9=\"NGN\",G31,(G31/$E$288))","v":175},null,70000]
[null,null,"Shipping cost",{"$f":"$E$9","v":"USD"},{"$f":"IF($E$9=\"NGN\",G32,(G32/$E$288))","v":8.75},null,3500]
[null,null,"Installation cost","% module cost",0.05]
[null,null,"Total COGS",{"$f":"$E$9","v":"USD"},{"$f":"SUM(E31:E32)*E33+(E31+E32)","v":192.9375}]
[]
[null,null,"Product 2",null,null,null,"NGN Inputs"]
[null,null,"System name","Name"]
[null,null,"System cost",{"$f":"$E$9","v":"USD"},{"$f":"IF($E$9=\"NGN\",G38,(G38/$E$288))","v":450},null,180000]
[null,null,"Shipping cost",{"$f":"$E$9","v":"USD"},{"$f":"IF($E$9=\"NGN\",G39,(G39/$E$288))","v":16.25},null,6500]
[null,null,"Installation cost","% module cost",0.05]
{"$rows_left_out":296}
{"sheet":"Model","index":5,"n_rows":235,"n_cols":16,"rows_kept":235,"cut":false,"hidden":false,"merged":[]}
[null,null,{"$f":"Name_Model","v":"FGN 5M Solar Connections Facility - SHS"}]
[]
[null,null,"Model"]
[]
[null,null,null,null,null,null,null,null,{"$f":"CONCATENATE(\"Annual  summary\",\" \",Inputs!$E$9)","v":"Annual  summary USD"}]
[null,null,"Year",null,null,null,null,null,{"$f":"Start_Year","v":2020},{"$f":"I6+1","v":2021},{"$f":"J6+1","v":2022},2023,2024,2025]
[null,null,"Period start",null,null,null,null,null,{"$f":"Inputs!E7","v":"2020-01-01"},{"$f":"EOMONTH(I7,11)+1","v":"2021-01-01"},{"$f":"EOMONTH(J7,11)+1","v":"2022-01-01"},"2023-01-01","2024-01-01","2025-01-01"]
[null,null,"Period end",null,null,null,null,"2020-01-01",{"$f":"EOMONTH(I7,11)","v":"2020-12-31"},{"$f":"EOMONTH(J7,11)","v":"2021-12-31"},"2022-12-31","2023-12-31","2024-12-31",{"$f":"EOMONTH(N7,11)","v":"2025-12-31"}]
[null,null,"Period"]
[null,null,"Inflation index",null,null,null,null,null,{"$f":"Inputs!I284","v":1},{"$f":"Inputs!J284","v":1.1000000000000001},{"$f":"Inputs!K284","v":1.2100000000000002},{"$f":"Inputs!L284","v":1.3310000000000004},{"$f":"Inputs!M284","v":1.4641000000000006},{"$f":"Inputs!N284","v":1.6105100000000008}]
[null,null,"USD:Naira FX rate (EOP)",null,null,null,null,{"$f":"Inputs!E288","v":400},{"$f":"Inputs!I287","v":400},{"$f":"Inputs!J287","v":432},{"$f":"Inputs!K287","v":466.56000000000006},{"$f":"Inputs!L287","v":503.8848000000001},{"$f":"Inputs!M287","v":544.19558400000017},{"$f":"Inputs!N287","v":587.73123072000021}]
[]
["●",null,"Income Statement"]
[]
[null,null,"Gross income"]
[null,null,"Sales revenue",{"$f":"Inputs!$E$9","v":"USD"},null,null,null,null,{"$f":"I120+I130+I140+I150+I160+I170","v":2670000},{"$f":"J120+J130+J140+J150+J160+J170","v":3738000},5046300,6560190,8528247.0000000019,10233896.400000002]
[null,null,"COGS ",{"$f":"Inputs!$E$9","v":"USD"},null,null,null,null,{"$f":"-(Inputs!$E$34*Inputs!I77)+-(Inputs!$E$41*Inputs!I92)+-(Inputs!$E$48*Inputs!I107)+-(Inputs!$E$55*Inputs!I122)+-(Inputs!$E$62*Inputs!I137)+-(Inputs!$E$69*Inputs!I152)","v":-1869525},{"$f":"-(Inputs!$E$34*Inputs!J77)+-(Inputs!$E$41*Inputs!J92)+-(Inputs!$E$48*Inputs!J107)+-(Inputs!$E$55*Inputs!J122)+-(Inputs!$E$62*Inputs!J137)+-(Inputs!$E$69*Inputs!J152)","v":-2617335},{"$f":"-(Inputs!$E$34*Inputs!K77)+-(Inputs!$E$41*Inputs!K92)+-(Inputs!$E$48*Inputs!K107)+-(Inputs!$E$55*Inputs!K122)+-(Inputs!$E$62*Inputs!K137)+-(Inputs!$E$69*Inputs!K152)","v":-3533402.25},{"$f":"-(Inputs!$E$34*Inputs!L77)+-(Inputs!$E$41*Inputs!L92)+-(Inputs!$E$48*Inputs!L107)+-(Inputs!$E$55*Inputs!L122)+-(Inputs!$E$62*Inputs!L137)+-(Inputs!$E$69*Inputs!L152)","v":-4593422.9249999998},{"$f":"-(Inputs!$E$34*Inputs!M77)+-(Inputs!$E$41*Inputs!M92)+-(Inputs!$E$48*Inputs!M107)+-(Inputs!$E$55*Inputs!M122)+-(Inputs!$E$62*Inputs!M137)+-(Inputs!$E$69*Inputs!M152)","v":-5971449.8025000002},{"$f":"-(Inputs!$E$34*Inputs!N77)+-(Inputs!$E$41*Inputs!N92)+-(Inputs!$E$48*Inputs!N107)+-(Inputs!$E$55*Inputs!N122)+-(Inputs!$E$62*Inputs!N137)+-(Inputs!$E$69*Inputs!N152)","v":-7165739.7630000003}]
[null,null,"Total gross income",{"$f":"Inputs!$E$9","v":"USD"},null,null,null,null,{"$f":"I16+I17","v":800475},{"$f":"J16+J17","v":1120665},1512897.75,1966767.0750000002,2556797.1975000016,3068156.637000002]
[]
[null,null,"Operating costs"]
[null,null,"Corporate salaries and benefits",{"$f":"Inputs!$E$9","v":"USD"},null,null,null,null,{"$f":"-Inputs!I173 *I10","v":-6303.75},{"$f":"-Inputs!J173 *J10","v":-9471},{"$f":"-Inputs!K173 *K10","v":-10418.100000000002},{"$f":"-Inputs!L173 *L10","v":-21078.048750000005},{"$f":"-Inputs!M173 *M10","v":-23185.853625000011},{"$f":"-Inputs!N173 *N10","v":-30209.141325000015}]
[null,null,"Corporate office expenses",{"$f":"Inputs!$E$9","v":"USD"},null,null,null,null,{"$f":"-Inputs!$E$181*I10","v":-3742.5},{"$f":"-Inputs!$E$181*J10","v":-4116.75},{"$f":"-Inputs!$E$181*K10","v":-4528.4250000000011},{"$f":"-Inputs!$E$181*L10","v":-4981.2675000000017},{"$f":"-Inputs!$E$181*M10","v":-5479.3942500000021},{"$f":"-Inputs!$E$181*N10","v":-6027.3336750000026}]
[null,null,"Corporate administrative expenses",{"$f":"Inputs!$E$9","v":"USD"},null,null,null,null,{"$f":"-Inputs!$E$188*I10","v":-1645},{"$f":"-Inputs!$E$188*J10","v":-1809.5000000000002},{"$f":"-Inputs!$E$188*K10","v":-1990.4500000000003},{"$f":"-Inputs!$E$188*L10","v":-2189.4950000000008},{"$f":"-Inputs!$E$188*M10","v":-2408.444500000001},{"$f":"-Inputs!$E$188*N10","v":-2649.2889500000015}]
[null,null,"Direct sales and service cost",{"$f":"Inputs!$E$9","v":"USD"},null,null,null,null,{"$f":"-Inputs!I206*I10","v":-57375},{"$f":"-Inputs!J206*J10","v":-87021},{"$f":"-Inputs!K206*K10","v":-127837.71000000002},{"$f":"-Inputs!L206*L10","v":-181420.35780000003},{"$f":"-Inputs!M206*M10","v":-257740.07615400015},{"$f":"-Inputs!N206*N10","v":-339057.33332328021}]
[null,null,"Total operating costs",{"$f":"Inputs!$E$9","v":"USD"},null,null,null,null,{"$f":"SUM(I21:I24)","v":-69066.25},-102418.25,-144774.68500000003,-209669.16905000003,-288813.76852900017,-377943.09727328026]
[]
[null,null,"VAT on sales",{"$f":"Inputs!$E$9","v":"USD"},null,{"$f":"Inputs!E228","v":7.4999999999999997E-2},null,null,{"$f":"-$F$27*I16","v":-200250},-280350,-378472.5,-492014.25,-639618.52500000014,-767542.2300000001]
[]
[null,null,"EBITDA",{"$f":"Inputs!$E$9","v":"USD"},null,null,null,null,{"$f":"I18+I25+I27","v":531158.75},737896.75,989650.56499999994,1265083.65595,1628364.9039710013,1922671.3097267216]
[]
[null,null,"Depreciation",{"$f":"Inputs!$E$9","v":"USD"},null,null,null,null,{"$f":"-(I180)","v":-300},{"$f":"-(J180)","v":-270},-729.1111111111112,-988.41879286694098,-889.57691358024681,-800.61922222222211]
[]
[null,null,"EBIT",{"$f":"Inputs!$E$9","v":"USD"},null,null,null,null,{"$f":"I29+I31","v":530858.75},{"$f":"J29+J31","v":737626.75},988921.45388888882,1264095.2371571332,1627475.327057421,1921870.6905044995]
[]
[null,null,"Interest expense",{"$f":"Inputs!$E$9","v":"USD"},null,null,null,null,{"$f":"-(IF(Inputs!$E$9=\"NGN\",(I213+I229),I222))","v":-2500},{"$f":"-(IF(Inputs!$E$9=\"NGN\",(J213+J229),J222))","v":-1875},{"$f":"-(IF(Inputs!$E$9=\"NGN\",(K213+K229),K222))","v":-1250},{"$f":"-(IF(Inputs!$E$9=\"NGN\",(L213+L229),L222))","v":-625},{"$f":"-(IF(Inputs!$E$9=\"NGN\",(M213+M229),M222))","v":0},{"$f":"-(IF(Inputs!$E$9=\"NGN\",(N213+N229),N222))","v":0}]
[null,null,"FX (gains)/losses",{"$f":"Inputs!$E$9","v":"USD"},null,null,null,null,{"$f":"(IF(Inputs!$E$9=\"NGN\",I228,0))","v":0},{"$f":"(IF(Inputs!$E$9=\"NGN\",J228,0))","v":0},{"$f":"(IF(Inputs!$E$9=\"NGN\",K228,0))","v":0},{"$f":"(IF(Inputs!$E$9=\"NGN\",L228,0))","v":0},{"$f":"(IF(Inputs!$E$9=\"NGN\",M228,0))","v":0},{"$f":"(IF(Inputs!$E$9=\"NGN\",N228,0))","v":0}]
[]
[null,null,"EBT",{"$f":"Inputs!$E$9","v":"USD"},null,null,null,null,{"$f":"I33+SUM(I35:I36)","v":528358.75},{"$f":"J33+SUM(J35:J36)","v":735751.75},987671.45388888882,1263470.2371571332,1627475.327057421,1921870.6905044995]
[null,null,null,null,null,null,null," "]
[null,null,"Income tax payable",{"$f":"Inputs!$E$9","v":"USD"},null,{"$f":"Inputs!E229","v":0.32},null,null,{"$f":"-$F40*MAX(I38,0)","v":-169074.80000000002},{"$f":"-$F40*MAX(J38,0)","v":-235440.56},-316054.8652444444,-404310.4758902826,-520792.10465837474,-614998.6209614398]
{"$rows_left_out":196}
{"sheet":"Graph Calcs","index":6,"n_rows":36,"n_cols":16,"rows_kept":36,"cut":false,"hidden":false,"merged":[]}
["Graph Calculations"]
[{"$f":"Name_Model","v":"FGN 5M Solar Connections Facility - SHS"}]
[]
[null,null,null,null,null,null,null,null,{"$f":"CONCATENATE(\"Annual  summary\",\" \",Inputs!$E$9)","v":"Annual  summary USD"},null,null,null,null,null,null,{"$f":"P6","v":0}]
[null,null,"Year",null,null,null,null,null,{"$f":"Start_Year","v":2020},{"$f":"I5+1","v":2021},{"$f":"J5+1","v":2022},2023,2024,2025]
[]
["x",null,"Graphs"]
[]
[null,null,"Income Statement"]
[null,null,"Revenue",{"$f":"Inputs!$E$9","v":"USD"},null,null,null,null,{"$f":"Model!I$16","v":2670000},{"$f":"Model!J$16","v":3738000},{"$f":"Model!K$16","v":5046300},{"$f":"Model!L$16","v":6560190},{"$f":"Model!M$16","v":8528247.0000000019},{"$f":"Model!N$16","v":10233896.400000002}]
[null,null,"Net income",{"$f":"Inputs!$E$9","v":"USD"},null,null,null,null,{"$f":"Model!I$42","v":359283.94999999995},{"$f":"Model!J$42","v":500311.19},{"$f":"Model!K$42","v":671616.58864444448},{"$f":"Model!L$42","v":859159.76126685063},{"$f":"Model!M$42","v":1106683.2223990462},{"$f":"Model!N$42","v":1306872.0695430597}]
[null,null,"Tax",{"$f":"Inputs!$E$9","v":"USD"},null,null,null,null,{"$f":"-Model!I40","v":169074.80000000002},{"$f":"-Model!J40","v":235440.56},{"$f":"-Model!K40","v":316054.8652444444},{"$f":"-Model!L40","v":404310.4758902826},{"$f":"-Model!M40","v":520792.10465837474},{"$f":"-Model!N40","v":614998.6209614398}]
[null,null,"Interest & FX depreciation",{"$f":"Inputs!$E$9","v":"USD"},null,null,null,null,{"$f":"-(Model!I35+Model!I36)","v":2500},{"$f":"-(Model!J35+Model!J36)","v":1875},{"$f":"-(Model!K35+Model!K36)","v":1250},{"$f":"-(Model!L35+Model!L36)","v":625},{"$f":"-(Model!M35+Model!M36)","v":0},{"$f":"-(Model!N35+Model!N36)","v":0}]
[null,null,"Depreciation",{"$f":"Inputs!$E$9","v":"USD"},null,null,null,null,{"$f":"-Model!I31","v":300},{"$f":"-Model!J31","v":270},{"$f":"-Model!K31","v":729.1111111111112},{"$f":"-Model!L31","v":988.41879286694098},{"$f":"-Model!M31","v":889.57691358024681},{"$f":"-Model!N31","v":800.61922222222211}]
[null,null,"OPEX & VAT",{"$f":"Inputs!$E$9","v":"USD"},null,null,null,null,{"$f":"-(Model!I25+Model!I27)","v":269316.25},{"$f":"-(Model!J25+Model!J27)","v":382768.25},{"$f":"-(Model!K25+Model!K27)","v":523247.18500000006},{"$f":"-(Model!L25+Model!L27)","v":701683.41905000003},{"$f":"-(Model!M25+Model!M27)","v":928432.29352900037},{"$f":"-(Model!N25+Model!N27)","v":1145485.3272732804}]
[null,null,"COGS",{"$f":"Inputs!$E$9","v":"USD"},null,null,null,null,{"$f":"-Model!I17","v":1869525},{"$f":"-Model!J17","v":2617335},{"$f":"-Model!K17","v":3533402.25},{"$f":"-Model!L17","v":4593422.9249999998},{"$f":"-Model!M17","v":5971449.8025000002},{"$f":"-Model!N17","v":7165739.7630000003}]
[null,null,"Net margin","%",null,null,null,null,{"$f":"'Graph Calcs'!I11/'Graph Calcs'!I10","v":0.13456327715355804},{"$f":"'Graph Calcs'!J11/'Graph Calcs'!J10","v":0.13384462011771001},{"$f":"'Graph Calcs'!K11/'Graph Calcs'!K10","v":0.13309089603163596},{"$f":"'Graph Calcs'!L11/'Graph Calcs'!L10","v":0.13096568258950589},{"$f":"'Graph Calcs'!M11/'Graph Calcs'!M10","v":0.1297667882272929},{"$f":"'Graph Calcs'!N11/'Graph Calcs'!N10","v":0.12770034192871635}]
[]
[null,null,"Cashflow Statement"]
[null,null,"Operating activities",{"$f":"Inputs!$E$9","v":"USD"},null,null,null,null,{"$f":"Model!I84","v":85954.360958904086},{"$f":"Model!J84","v":391129.3543835617},{"$f":"Model!K84","v":538267.20112541853},{"$f":"Model!L84","v":705000.20307341637},{"$f":"Model!M84","v":905880.4292304347},{"$f":"Model!N84","v":1132872.6346940487}]
[null,null,"CAPEX",{"$f":"Inputs!$E$9","v":"USD"},null,null,null,null,{"$f":"Model!I87","v":0},{"$f":"Model!J87","v":-4861.1111111111113},{"$f":"Model!K87","v":-3322.1879286694098},{"$f":"Model!L87","v":0},{"$f":"Model!M87","v":0},{"$f":"Model!N87","v":-2041.7495911012588}]
[null,null,"Debt repayment ",{"$f":"Inputs!$E$9","v":"USD"},null,null,null,null,{"$f":"Model!I232+Model!I94","v":0},{"$f":"Model!J232+Model!J94","v":-12500},{"$f":"Model!K232+Model!K94","v":-12500},{"$f":"Model!L232+Model!L94","v":-12500},{"$f":"Model!M232+Model!M94","v":-12500},{"$f":"Model!N232+Model!N94","v":0}]
[null,null,"Debt issuance",{"$f":"Inputs!$E$9","v":"USD"},null,null,null,null,{"$f":"Model!I234+Model!I96","v":135954.36095890409},{"$f":"Model!J234+Model!J96","v":373768.24327245058},{"$f":"Model!K234+Model!K96","v":522445.01319674915},{"$f":"Model!L234+Model!L96","v":692500.20307341637},{"$f":"Model!M234+Model!M96","v":893380.4292304347},{"$f":"Model!N234+Model!N96","v":1130830.8851029475}]
[null,null,"Equity or grants",{"$f":"Inputs!$E$9","v":"USD"},null,null,null,null,{"$f":"Model!I67+Model!I68","v":54025},{"$f":"Model!J67+Model!J68","v":54025},{"$f":"Model!K67+Model!K68","v":54025},{"$f":"Model!L67+Model!L68","v":54025},{"$f":"Model!M67+Model!M68","v":54025},{"$f":"Model!N67+Model!N68","v":54025}]
[null,null,"End cash",{"$f":"Inputs!$E$9","v":"USD"},null,null,null,null,{"$f":"Model!I103","v":188079.36095890409},{"$f":"Model!J103","v":561847.60423135466},{"$f":"Model!K103","v":1084292.6174281039},{"$f":"Model!L103","v":1776792.8205015203},{"$f":"Model!M103","v":2670173.2497319551},{"$f":"Model!N103","v":3801004.1348349024}]
[]
[null,null,"Sales & Working Capital need"]
[null,null,"Sales",{"$f":"Inputs!$E$9","v":"USD"},null,null,null,null,{"$f":"Model!I16","v":2670000},{"$f":"Model!J16","v":3738000},{"$f":"Model!K16","v":5046300},{"$f":"Model!L16","v":6560190},{"$f":"Model!M16","v":8528247.0000000019},{"$f":"Model!N16","v":10233896.400000002}]
[null,null,"Working capital",{"$f":"Inputs!$E$9","v":"USD"},null,null,null,null,{"$f":"Model!I197","v":273629.58904109587},{"$f":"Model!J197","v":383081.42465753417},{"$f":"Model!K197","v":517159.92328767129},{"$f":"Model!L197","v":672307.90027397254},{"$f":"Model!M197","v":874000.27035616431},{"$f":"Model!N197","v":1048800.3244273975}]
[]
[null,null,"OPEX Breakdown"]
[null,null,"Total OPEX",{"$f":"Inputs!$E$9","v":"USD"},null,null,null,null,{"$f":"-Model!I25","v":69066.25},{"$f":"-Model!J25","v":102418.25},{"$f":"-Model!K25","v":144774.68500000003},{"$f":"-Model!L25","v":209669.16905000003},{"$f":"-Model!M25","v":288813.76852900017},{"$f":"-Model!N25","v":377943.09727328026}]
[]
[null,null,"Equity payback graph"]
[null,null,"Equity invested",{"$f":"Inputs!$E$9","v":"USD"},null,null,null,null,{"$f":"Model!I67","v":4025},{"$f":"Model!J67","v":4025},{"$f":"Model!K67","v":4025},{"$f":"Model!L67","v":4025},{"$f":"Model!M67","v":4025},{"$f":"Model!N67","v":4025}]
[null,null,"Distributions to equity",{"$f":"Inputs!$E$9","v":"USD"},null,null,null,null,{"$f":"Model!I106","v":85954.360958904086},{"$f":"Model!J106","v":373768.24327245058},{"$f":"Model!K106","v":522445.01319674915},{"$f":"Model!L106","v":692500.20307341637},{"$f":"Model!M106","v":893380.4292304347},{"$f":"Model!N106","v":1130830.8851029475}]